Build: #10 failed Child of MIREBALAIS-DTCM-394

Build result summary

Details

Completed
Duration
8 minutes
Labels
None
Agent
Default Agent
Revision
ef9dee83c1e4e44abcaa3284643dc066b786fceb ef9dee83c1e4e44abcaa3284643dc066b786fceb
Total tests
2
Failing since
#9 (Child of MIREBALAIS-DTCM-393)

Responsible

This build has been failing since #9
No one has taken responsibility

Tests

Existing test failures 2
Status Test Failing since View job Duration
org.openqa.selenium.TimeoutException: Timed out after 5 seconds waiting for visibility of element located by By.id: patient-search Build info: version: '2.25.0', revision: '17482', time: '2012-07-18 22:18:01' System info: os.name: 'Linux', os.arch: 'amd64', os.version: '4.14.75-rh105-20181011003230.xenU.x86_64', java.version: '1.8.0_181' Driver info: driver.version: unknown
org.openqa.selenium.TimeoutException: Timed out after 5 seconds waiting for visibility of element located by By.id: patient-search
Build info: version: '2.25.0', revision: '17482', time: '2012-07-18 22:18:01'
System info: os.name: 'Linux', os.arch: 'amd64', os.version: '4.14.75-rh105-20181011003230.xenU.x86_64', java.version: '1.8.0_181'
Driver info: driver.version: unknown
	at org.openqa.selenium.support.ui.FluentWait.timeoutException(FluentWait.java:255)
	at org.openqa.selenium.support.ui.FluentWait.timeoutException(FluentWait.java:270)
	at org.openqa.selenium.support.ui.FluentWait.until(FluentWait.java:222)
(75 more lines...)
org.openqa.selenium.NoSuchElementException: no such element: Unable to locate element: {"method":"id","selector":"username"}   (Session info: chrome=68.0.3440.106)   (Driver info: chromedriver=2.37.544315 (730aa6a5fdba159ac9f4c1e8cbc59bf1b5ce12b7),platform=Linux 4.14.75-rh105-20181011003230.xenU.x86_64 x86_64) (WARNING: The server did not provide any stacktrace information) Command duration or timeout: 20.07 seconds For documentation on this error, please visit: http://seleniumhq.org/exceptions/no_such_element.html Build info: version: '2.25.0', revision: '17482', time: '2012-07-18 22:18:01' System info: os.name: 'Linux', os.arch: 'amd64', os.version: '4.14.75-rh105-20181011003230.xenU.x86_64', java.version: '1.8.0_181' Driver info: driver.version: RemoteWebDriver Session ID: 1ec68d6978a4c6446d57e33217ffb7ce
org.openqa.selenium.NoSuchElementException: no such element: Unable to locate element: {"method":"id","selector":"username"}
  (Session info: chrome=68.0.3440.106)
  (Driver info: chromedriver=2.37.544315 (730aa6a5fdba159ac9f4c1e8cbc59bf1b5ce12b7),platform=Linux 4.14.75-rh105-20181011003230.xenU.x86_64 x86_64) (WARNING: The server did not provide any stacktrace information)
Command duration or timeout: 20.07 seconds
For documentation on this error, please visit: http://seleniumhq.org/exceptions/no_such_element.html
Build info: version: '2.25.0', revision: '17482', time: '2012-07-18 22:18:01'
System info: os.name: 'Linux', os.arch: 'amd64', os.version: '4.14.75-rh105-20181011003230.xenU.x86_64', java.version: '1.8.0_181'
(63 more lines...)