Build: #5483 failed Child of MIREBALAIS-DCI-5549

Build result summary

Details

Completed
Duration
46 minutes
Labels
None
Agent
Default Agent
Revision
98b9dd66a5bfb323f3f7f44c46a2c661665d9449 98b9dd66a5bfb323f3f7f44c46a2c661665d9449
Total tests
8
Failing since
#5481 (Child of MIREBALAIS-DCI-5545)

Responsible

This build has been failing since #5481
No one has taken responsibility

Tests

New test failures 1
Status Test View job Duration
Collapse Failed VisitNoteTest testCreatePedsFollowupOutpatientEncounter History
Default Job 1 min
org.openqa.selenium.NoSuchElementException: no such element: Unable to locate element: {"method":"css selector","selector":"#general-exam-comments textarea"}   (Session info: chrome=72.0.3626.109)   (Driver info: chromedriver=2.37.544315 (730aa6a5fdba159ac9f4c1e8cbc59bf1b5ce12b7),platform=Linux 4.14.121-rh150-20190522001511.xenU.x86_64 x86_64) (WARNING: The server did not provide any stacktrace information) Command duration or timeout: 20.06 seconds For documentation on this error, please visit: http://seleniumhq.org/exceptions/no_such_element.html Build info: version: '2.25.0', revision: '17482', time: '2012-07-18 22:18:01' System info: os.name: 'Linux', os.arch: 'amd64', os.version: '4.14.121-rh150-20190522001511.xenU.x86_64', java.version: '1.8.0_201' Driver info: driver.version: RemoteWebDriver Session ID: e6aa5bed88c13e46ea5d7a9b0ceab4dc
org.openqa.selenium.NoSuchElementException: no such element: Unable to locate element: {"method":"css selector","selector":"#general-exam-comments textarea"}
  (Session info: chrome=72.0.3626.109)
  (Driver info: chromedriver=2.37.544315 (730aa6a5fdba159ac9f4c1e8cbc59bf1b5ce12b7),platform=Linux 4.14.121-rh150-20190522001511.xenU.x86_64 x86_64) (WARNING: The server did not provide any stacktrace information)
Command duration or timeout: 20.06 seconds
For documentation on this error, please visit: http://seleniumhq.org/exceptions/no_such_element.html
Build info: version: '2.25.0', revision: '17482', time: '2012-07-18 22:18:01'
System info: os.name: 'Linux', os.arch: 'amd64', os.version: '4.14.121-rh150-20190522001511.xenU.x86_64', java.version: '1.8.0_201'
(60 more lines...)
Existing test failures 1
Status Test Failing since View job Duration
org.openqa.selenium.TimeoutException: Timed out after 5 seconds waiting for element to be clickable: By.selector: #presenting-history textarea Build info: version: '2.25.0', revision: '17482', time: '2012-07-18 22:18:01' System info: os.name: 'Linux', os.arch: 'amd64', os.version: '4.14.121-rh150-20190522001511.xenU.x86_64', java.version: '1.8.0_201' Driver info: driver.version: unknown
org.openqa.selenium.TimeoutException: Timed out after 5 seconds waiting for element to be clickable: By.selector: #presenting-history textarea
Build info: version: '2.25.0', revision: '17482', time: '2012-07-18 22:18:01'
System info: os.name: 'Linux', os.arch: 'amd64', os.version: '4.14.121-rh150-20190522001511.xenU.x86_64', java.version: '1.8.0_201'
Driver info: driver.version: unknown
	at org.openqa.selenium.support.ui.FluentWait.timeoutException(FluentWait.java:255)
	at org.openqa.selenium.support.ui.FluentWait.timeoutException(FluentWait.java:270)
	at org.openqa.selenium.support.ui.FluentWait.until(FluentWait.java:222)
(75 more lines...)