Build: #5832 failed Manual run by Mark Goodrich

Build result summary

Details

Completed
Duration
10 minutes
Labels
None
Agent
Default Agent
Revision
d2f8c47ed78190ec5c63a081ab91a59056ac0c76 d2f8c47ed78190ec5c63a081ab91a59056ac0c76
Total tests
8
Failing since
#5831 (Child of MIREBALAIS-DCI-5960)

Responsible

This build has been failing since #5831
No one has taken responsibility

Tests

New test failures 1
Status Test View job Duration
Collapse Failed VisitNoteTest testCreateAdultFollowupOutpatientEncounter History
Default Job 1 min
org.openqa.selenium.NoSuchElementException: no such element: Unable to locate element: {"method":"css selector","selector":"#general-exam-comments textarea"}   (Session info: chrome=78.0.3904.108)   (Driver info: chromedriver=2.37.544315 (730aa6a5fdba159ac9f4c1e8cbc59bf1b5ce12b7),platform=Linux 4.14.155-rh186-20191120235918.xenU.x86_64 x86_64) (WARNING: The server did not provide any stacktrace information) Command duration or timeout: 20.02 seconds For documentation on this error, please visit: http://seleniumhq.org/exceptions/no_such_element.html Build info: version: '2.25.0', revision: '17482', time: '2012-07-18 22:18:01' System info: os.name: 'Linux', os.arch: 'amd64', os.version: '4.14.155-rh186-20191120235918.xenU.x86_64', java.version: '1.8.0_201' Driver info: driver.version: RemoteWebDriver Session ID: d3281caede65d2aea0f385aa0ce0501b
org.openqa.selenium.NoSuchElementException: no such element: Unable to locate element: {"method":"css selector","selector":"#general-exam-comments textarea"}
  (Session info: chrome=78.0.3904.108)
  (Driver info: chromedriver=2.37.544315 (730aa6a5fdba159ac9f4c1e8cbc59bf1b5ce12b7),platform=Linux 4.14.155-rh186-20191120235918.xenU.x86_64 x86_64) (WARNING: The server did not provide any stacktrace information)
Command duration or timeout: 20.02 seconds
For documentation on this error, please visit: http://seleniumhq.org/exceptions/no_such_element.html
Build info: version: '2.25.0', revision: '17482', time: '2012-07-18 22:18:01'
System info: os.name: 'Linux', os.arch: 'amd64', os.version: '4.14.155-rh186-20191120235918.xenU.x86_64', java.version: '1.8.0_201'
(60 more lines...)
Existing test failures 1
Status Test Failing since View job Duration
org.openqa.selenium.WebDriverException: unknown error: Element <td nowrap="" ng-repeat="sequence in sequences" ng-class="{ impossible: !isDoseValidForVaccination(sequence, vaccination) }" class="ng-scope">...</td> is not clickable at point (461, 450). Other element would receive the click: <div class="content" ng-show="showVaccinationTable">...</div>   (Session info: chrome=78.0.3904.108)   (Driver info: chromedriver=2.37.544315 (730aa6a5fdba159ac9f4c1e8cbc59bf1b5ce12b7),platform=Linux 4.14.155-rh186-20191120235918.xenU.x86_64 x86_64) (WARNING: The server did not provide any stacktrace information) Command duration or timeout: 85 milliseconds Build info: version: '2.25.0', revision: '17482', time: '2012-07-18 22:18:01' System info: os.name: 'Linux', os.arch: 'amd64', os.version: '4.14.155-rh186-20191120235918.xenU.x86_64', java.version: '1.8.0_201' Driver info: driver.version: RemoteWebDriver Session ID: d3281caede65d2aea0f385aa0ce0501b
org.openqa.selenium.WebDriverException: unknown error: Element <td nowrap="" ng-repeat="sequence in sequences" ng-class="{ impossible: !isDoseValidForVaccination(sequence, vaccination) }" class="ng-scope">...</td> is not clickable at point (461, 450). Other element would receive the click: <div class="content" ng-show="showVaccinationTable">...</div>
  (Session info: chrome=78.0.3904.108)
  (Driver info: chromedriver=2.37.544315 (730aa6a5fdba159ac9f4c1e8cbc59bf1b5ce12b7),platform=Linux 4.14.155-rh186-20191120235918.xenU.x86_64 x86_64) (WARNING: The server did not provide any stacktrace information)
Command duration or timeout: 85 milliseconds
Build info: version: '2.25.0', revision: '17482', time: '2012-07-18 22:18:01'
System info: os.name: 'Linux', os.arch: 'amd64', os.version: '4.14.155-rh186-20191120235918.xenU.x86_64', java.version: '1.8.0_201'
Driver info: driver.version: RemoteWebDriver
(57 more lines...)
Fixed tests 1
Status Test Failing since View job Duration
Successful VisitNoteTest testCreateAdultInitialOutpatientEncounter History
Default Job 1 min