Build: #5061 failed Child of MIREBALAIS-RADIOLOGYAPP-4310

Build result summary

Details

Completed
Duration
1 minute
Labels
None
Agent
endtb agent
Revision
08fc004af866e712ce3d38cd0c4786b5a0e569d8 08fc004af866e712ce3d38cd0c4786b5a0e569d8
Total tests
47
Failing since
#5052 (Child of MIREBALAIS-RADIOLOGYAPP-4302)

Responsible

This build has been failing since #5052
No one has taken responsibility

Tests

Existing test failures 6
Status Test Failing since View job Duration
java.lang.AssertionError:  Expected: is <2>      but: was <0>
java.lang.AssertionError: 
Expected: is <2>
     but: was <0>
	at org.hamcrest.MatcherAssert.assertThat(MatcherAssert.java:20)
	at org.junit.Assert.assertThat(Assert.java:865)
	at org.junit.Assert.assertThat(Assert.java:832)
	at org.openmrs.module.pacsintegration.component.HL7ListenerCreateTwoReportsComponentTest.shouldCreateTwoReportsIfBodyDifferent(HL7ListenerCreateTwoReportsComponentTest.java:125)
(35 more lines...)
java.lang.AssertionError:  Expected: is <1>      but: was <0>
java.lang.AssertionError: 
Expected: is <1>
     but: was <0>
	at org.hamcrest.MatcherAssert.assertThat(MatcherAssert.java:20)
	at org.junit.Assert.assertThat(Assert.java:865)
	at org.junit.Assert.assertThat(Assert.java:832)
	at org.openmrs.module.pacsintegration.component.HL7ListenerIgnoreDuplicateOrderComponentTest.shouldNotImportORM_001MessageWithDuplicateOrderNumber(HL7ListenerIgnoreDuplicateOrderComponentTest.java:124)
(35 more lines...)
java.lang.AssertionError:  Expected: is <1>      but: was <0>
java.lang.AssertionError: 
Expected: is <1>
     but: was <0>
	at org.hamcrest.MatcherAssert.assertThat(MatcherAssert.java:20)
	at org.junit.Assert.assertThat(Assert.java:865)
	at org.junit.Assert.assertThat(Assert.java:832)
	at org.openmrs.module.pacsintegration.component.HL7ListenerIgnoreDuplicateReportComponentTest.shouldNotCreateDuplicateReport(HL7ListenerIgnoreDuplicateReportComponentTest.java:116)
(35 more lines...)
java.lang.AssertionError:  Expected: is <1>      but: was <0>
java.lang.AssertionError: 
Expected: is <1>
     but: was <0>
	at org.hamcrest.MatcherAssert.assertThat(MatcherAssert.java:20)
	at org.junit.Assert.assertThat(Assert.java:865)
	at org.junit.Assert.assertThat(Assert.java:832)
	at org.openmrs.module.pacsintegration.component.HL7ListenerParseORMComponentTest.shouldListenForAndParseORM_001Message(HL7ListenerParseORMComponentTest.java:124)
(35 more lines...)
java.lang.AssertionError:  Expected: is <1>      but: was <0>
java.lang.AssertionError: 
Expected: is <1>
     but: was <0>
	at org.hamcrest.MatcherAssert.assertThat(MatcherAssert.java:20)
	at org.junit.Assert.assertThat(Assert.java:865)
	at org.junit.Assert.assertThat(Assert.java:832)
	at org.openmrs.module.pacsintegration.component.HL7ListenerParseORUComponentTest.shouldListenForAndParseORU_R01Message(HL7ListenerParseORUComponentTest.java:118)
(35 more lines...)
java.lang.AssertionError:  Expected: is <1>      but: was <0>
java.lang.AssertionError: 
Expected: is <1>
     but: was <0>
	at org.hamcrest.MatcherAssert.assertThat(MatcherAssert.java:20)
	at org.junit.Assert.assertThat(Assert.java:865)
	at org.junit.Assert.assertThat(Assert.java:832)
	at org.openmrs.module.pacsintegration.component.HL7ListenerParseORUWithMissingProcedureCodeComponentTest.shouldListenForAndParseORU_R01MessageMissingProcedureCode(HL7ListenerParseORUWithMissingProcedureCodeComponentTest.java:117)
(35 more lines...)